build under Max OS X El Capitan fails

classic Classic list List threaded Threaded
7 messages Options
Reply | Threaded
Open this post in threaded view
|  
Report Content as Inappropriate

build under Max OS X El Capitan fails

Théo de la Hogue-2
Hi all,
just to warn you that JamomaMax no longer builds under the last Mac OS X version.

here is my console output (after having configured and generated CMake files).

is anyone have an idea how to fix this ?

Best,
TO

wall-e:Max WALL-E$ make clean
wall-e:Max WALL-E$ make -j 8
Scanning dependencies of target MaxCommonSyms
Scanning dependencies of target TTClassWrapperMax
Scanning dependencies of target TTModularClassWrapperMax
[  0%] Building CXX object JamomaCore/Modular/library/CMakeFiles/TTProtocol.dir/source/TTProtocol.cpp.o
[  1%] Building CXX object JamomaCore/Modular/library/CMakeFiles/TTClock.dir/source/TTClock.cpp.o
[  1%] Building CXX object JamomaCore/Score/CMakeFiles/TimePluginLib.dir/extensions/TimePluginLib.cpp.o
Scanning dependencies of target MaxAudioGraph
[  1%] Building CXX object source/CMakeFiles/MaxCommonSyms.dir/c74support/max-includes/common/commonsyms.cpp.o
[  1%] Building CXX object source/CMakeFiles/TTClassWrapperMax.dir/classwrapper/TTClassWrapperMax.cpp.o
[  1%] Building CXX object source/CMakeFiles/TTModularClassWrapperMax.dir/classwrapper/TTModularClassWrapperMax.cpp.o
[  1%] Building CXX object JamomaCore/Foundation/library/CMakeFiles/Foundation.dir/source/TTFoundation.cpp.o
[  2%] Building CXX object source/CMakeFiles/MaxAudioGraph.dir/classwrapper/MaxAudioGraph.cpp.o
In file included from In file included from In file included from /Users/WALL-E/Documents/Developpements/Jamoma/Max/JamomaCore/Foundation/library/source/TTFoundation.cppIn file included from :9:
/Users/WALL-E/Documents/Developpements/Jamoma/Max/JamomaCore/Score/extensions/TimePluginLib.cppIn file included from /Users/WALL-E/Documents/Developpements/Jamoma/Max/JamomaCore/Modular/library/source/TTProtocol.cpp/Users/WALL-E/Documents/Developpements/Jamoma/Max/JamomaCore/Foundation/library/includes/TTFoundation.h::1714:
:
/Users/WALL-E/Documents/Developpements/Jamoma/Max/JamomaCore/Modular/library/source/TTClock.cppIn file included from :/Users/WALL-E/Documents/Developpements/Jamoma/Max/JamomaCore/Modular/library/includes/TTProtocol.h17::
20In file included from :
/Users/WALL-E/Documents/Developpements/Jamoma/Max/JamomaCore/Modular/library/includes/TTClock.hIn file included from ::20/Users/WALL-E/Documents/Developpements/Jamoma/Max/JamomaCore/Foundation/library/includes/TTFoundationAPI.h16:
::
In file included from 13In file included from /Users/WALL-E/Documents/Developpements/Jamoma/Max/JamomaCore/Foundation/library/includes/TTFoundationAPI.h:
:/Users/WALL-E/Documents/Developpements/Jamoma/Max/JamomaCore/Score/extensions/TimePluginLib.hIn file included from 13:/Users/WALL-E/Documents/Developpements/Jamoma/Max/JamomaCore/Foundation/library/includes/TTFoundation.h:
21:In file included from :
14/Users/WALL-E/Documents/Developpements/Jamoma/Max/JamomaCore/Foundation/library/includes/TTFoundation.h:
:In file included from 14/Users/WALL-E/Documents/Developpements/Jamoma/Max/JamomaCore/Score/library/includes/TTScore.h:
:21:
/Users/WALL-E/Documents/Developpements/Jamoma/Max/source/c74support/max-includes/common/commonsyms.cpp:4:10: fatal error: /Users/WALL-E/Documents/Developpements/Jamoma/Max/JamomaCore/Foundation/library/includes/TTBase.h:/Users/WALL-E/Documents/Developpements/Jamoma/Max/JamomaCore/Foundation/library/includes/TTBase.h/Users/WALL-E/Documents/Developpements/Jamoma/Max/JamomaCore/Foundation/library/includes/TTBase.h24::/Users/WALL-E/Documents/Developpements/Jamoma/Max/JamomaCore/Score/library/includes/TTScoreIncludes.h:242411'Carbon/Carbon.h'::: 42 file11: :not11fatal error ::: found10 :
  'TargetConditionals.h' fatal errorfile:  fatal errornotfatal error : : found'TargetConditionals.h' 
'TargetConditionals.h'file'math.h'   filenotfile   notnotfound  foundfound


        #include "TargetConditionals.h"        #include "TargetConditionals.h"
        #include "TargetConditionals.h"

#include <math.h>                 ^#include <Carbon/Carbon.h>                 ^



                 ^         ^

         ^
In file included from In file included from /Users/WALL-E/Documents/Developpements/Jamoma/Max/source/classwrapper/MaxAudioGraph.cpp/Users/WALL-E/Documents/Developpements/Jamoma/Max/source/classwrapper/TTClassWrapperMax.cpp::1710:
:
In file included from In file included from /Users/WALL-E/Documents/Developpements/Jamoma/Max/source/classwrapper/MaxAudioGraph.h/Users/WALL-E/Documents/Developpements/Jamoma/Max/source/classwrapper/TTClassWrapperMax.h::2013:
:
In file included from In file included from /Users/WALL-E/Documents/Developpements/Jamoma/Max/source/c74support/max-includes/ext.h/Users/WALL-E/Documents/Developpements/Jamoma/Max/source/c74support/max-includes/ext.h::2020:
:
/Users/WALL-E/Documents/Developpements/Jamoma/Max/source/c74support/max-includes/ext_prefix.h/Users/WALL-E/Documents/Developpements/Jamoma/Max/source/c74support/max-includes/ext_prefix.h::147147::10:10 : fatal error: fatal error: 'MacTypes.h''MacTypes.h'  filefile  notnot  foundfound

In file included from #include <MacTypes.h>#include <MacTypes.h>

/Users/WALL-E/Documents/Developpements/Jamoma/Max/source/classwrapper/TTModularClassWrapperMax.cpp:         ^         ^10

:
In file included from /Users/WALL-E/Documents/Developpements/Jamoma/Max/source/classwrapper/TTModularClassWrapperMax.h:20:
In file included from /Users/WALL-E/Documents/Developpements/Jamoma/Max/source/c74support/max-includes/ext.h:20:
/Users/WALL-E/Documents/Developpements/Jamoma/Max/source/c74support/max-includes/ext_prefix.h:147:10: fatal error: 'MacTypes.h' file not found
#include <MacTypes.h>
         ^
1 error generated.
make[2]: *** [source/CMakeFiles/MaxCommonSyms.dir/c74support/max-includes/common/commonsyms.cpp.o] Error 1
make[1]: *** [source/CMakeFiles/MaxCommonSyms.dir/all] Error 2
make[1]: *** Waiting for unfinished jobs....
[  2%] Building CXX object JamomaCore/Foundation/library/CMakeFiles/Foundation.dir/source/TTCallback.cpp.o
In file included from /Users/WALL-E/Documents/Developpements/Jamoma/Max/JamomaCore/Foundation/library/source/TTCallback.cpp:18:
In file included from /Users/WALL-E/Documents/Developpements/Jamoma/Max/JamomaCore/Foundation/library/includes/TTCallback.h:21:
In file included from /Users/WALL-E/Documents/Developpements/Jamoma/Max/JamomaCore/Foundation/library/includes/TTFoundationAPI.h:13:
In file included from /Users/WALL-E/Documents/Developpements/Jamoma/Max/JamomaCore/Foundation/library/includes/TTFoundation.h:14:
/Users/WALL-E/Documents/Developpements/Jamoma/Max/JamomaCore/Foundation/library/includes/TTBase.h:24:11: fatal error: 'TargetConditionals.h' file not found
        #include "TargetConditionals.h"
                 ^
1 error generated.
1 error generated.
make[2]: *** [JamomaCore/Foundation/library/CMakeFiles/Foundation.dir/source/TTCallback.cpp.o] Error 1
make[2]: *** Waiting for unfinished jobs....
make[2]: *** [JamomaCore/Modular/library/CMakeFiles/TTClock.dir/source/TTClock.cpp.o] Error 1
make[1]: *** [JamomaCore/Modular/library/CMakeFiles/TTClock.dir/all] Error 2
1 error generated.
make[2]: *** [JamomaCore/Modular/library/CMakeFiles/TTProtocol.dir/source/TTProtocol.cpp.o] Error 1
make[1]: *** [JamomaCore/Modular/library/CMakeFiles/TTProtocol.dir/all] Error 2
[  2%] Building CXX object source/CMakeFiles/MaxAudioGraph.dir/classwrapper/MaxGraph.cpp.o
1 error generated.
make[2]: *** [JamomaCore/Foundation/library/CMakeFiles/Foundation.dir/source/TTFoundation.cpp.o] Error 1
make[1]: *** [JamomaCore/Foundation/library/CMakeFiles/Foundation.dir/all] Error 2
In file included from /Users/WALL-E/Documents/Developpements/Jamoma/Max/source/classwrapper/MaxGraph.cpp:11:
In file included from /Users/WALL-E/Documents/Developpements/Jamoma/Max/source/classwrapper/MaxGraph.h:14:
In file included from /Users/WALL-E/Documents/Developpements/Jamoma/Max/source/c74support/max-includes/ext.h:20:
/Users/WALL-E/Documents/Developpements/Jamoma/Max/source/c74support/max-includes/ext_prefix.h:147:10: fatal error: 'MacTypes.h' file not found
#include <MacTypes.h>
         ^
1 error generated.
make[2]: *** [source/CMakeFiles/TTModularClassWrapperMax.dir/classwrapper/TTModularClassWrapperMax.cpp.o] Error 1
make[1]: *** [source/CMakeFiles/TTModularClassWrapperMax.dir/all] Error 2
1 error generated.
make[2]: *** [JamomaCore/Score/CMakeFiles/TimePluginLib.dir/extensions/TimePluginLib.cpp.o] Error 1
make[1]: *** [JamomaCore/Score/CMakeFiles/TimePluginLib.dir/all] Error 2
1 error generated.
1 error generated.
make[2]: *** [source/CMakeFiles/MaxAudioGraph.dir/classwrapper/MaxAudioGraph.cpp.o] Error 1
make[2]: *** Waiting for unfinished jobs....
make[2]: *** [source/CMakeFiles/TTClassWrapperMax.dir/classwrapper/TTClassWrapperMax.cpp.o] Error 1
make[1]: *** [source/CMakeFiles/TTClassWrapperMax.dir/all] Error 2
1 error generated.
make[2]: *** [source/CMakeFiles/MaxAudioGraph.dir/classwrapper/MaxGraph.cpp.o] Error 1
make[1]: *** [source/CMakeFiles/MaxAudioGraph.dir/all] Error 2
make: *** [all] Error 2
wall-e:Max WALL-E$

------------------------------------------------------------------------------

_______________________________________________
Jamoma-devel mailing list
[hidden email]
https://lists.sourceforge.net/lists/listinfo/jamoma-devel
Reply | Threaded
Open this post in threaded view
|  
Report Content as Inappropriate

Re: build under Max OS X El Capitan fails

Antoine Villeret
hi theo, 

seems that some file are not found.

could re-run make without -j 8 option ?
-j 8 causes error message to be scramble all together and not easily readable.

best

Antoine

--
do it yourself                      
http://antoine.villeret.free.fr

2015-10-02 11:54 GMT+02:00 Théo de la Hogue <[hidden email]>:
Hi all,
just to warn you that JamomaMax no longer builds under the last Mac OS X version.

here is my console output (after having configured and generated CMake files).

is anyone have an idea how to fix this ?

Best,
TO

wall-e:Max WALL-E$ make clean
wall-e:Max WALL-E$ make -j 8
Scanning dependencies of target MaxCommonSyms
Scanning dependencies of target TTClassWrapperMax
Scanning dependencies of target TTModularClassWrapperMax
[  0%] Building CXX object JamomaCore/Modular/library/CMakeFiles/TTProtocol.dir/source/TTProtocol.cpp.o
[  1%] Building CXX object JamomaCore/Modular/library/CMakeFiles/TTClock.dir/source/TTClock.cpp.o
[  1%] Building CXX object JamomaCore/Score/CMakeFiles/TimePluginLib.dir/extensions/TimePluginLib.cpp.o
Scanning dependencies of target MaxAudioGraph
[  1%] Building CXX object source/CMakeFiles/MaxCommonSyms.dir/c74support/max-includes/common/commonsyms.cpp.o
[  1%] Building CXX object source/CMakeFiles/TTClassWrapperMax.dir/classwrapper/TTClassWrapperMax.cpp.o
[  1%] Building CXX object source/CMakeFiles/TTModularClassWrapperMax.dir/classwrapper/TTModularClassWrapperMax.cpp.o
[  1%] Building CXX object JamomaCore/Foundation/library/CMakeFiles/Foundation.dir/source/TTFoundation.cpp.o
[  2%] Building CXX object source/CMakeFiles/MaxAudioGraph.dir/classwrapper/MaxAudioGraph.cpp.o
In file included from In file included from In file included from /Users/WALL-E/Documents/Developpements/Jamoma/Max/JamomaCore/Foundation/library/source/TTFoundation.cppIn file included from :9:
/Users/WALL-E/Documents/Developpements/Jamoma/Max/JamomaCore/Score/extensions/TimePluginLib.cppIn file included from /Users/WALL-E/Documents/Developpements/Jamoma/Max/JamomaCore/Modular/library/source/TTProtocol.cpp/Users/WALL-E/Documents/Developpements/Jamoma/Max/JamomaCore/Foundation/library/includes/TTFoundation.h::1714:
:
/Users/WALL-E/Documents/Developpements/Jamoma/Max/JamomaCore/Modular/library/source/TTClock.cppIn file included from :/Users/WALL-E/Documents/Developpements/Jamoma/Max/JamomaCore/Modular/library/includes/TTProtocol.h17::
20In file included from :
/Users/WALL-E/Documents/Developpements/Jamoma/Max/JamomaCore/Modular/library/includes/TTClock.hIn file included from ::20/Users/WALL-E/Documents/Developpements/Jamoma/Max/JamomaCore/Foundation/library/includes/TTFoundationAPI.h16:
::
In file included from 13In file included from /Users/WALL-E/Documents/Developpements/Jamoma/Max/JamomaCore/Foundation/library/includes/TTFoundationAPI.h:
:/Users/WALL-E/Documents/Developpements/Jamoma/Max/JamomaCore/Score/extensions/TimePluginLib.hIn file included from 13:/Users/WALL-E/Documents/Developpements/Jamoma/Max/JamomaCore/Foundation/library/includes/TTFoundation.h:
21:In file included from :
14/Users/WALL-E/Documents/Developpements/Jamoma/Max/JamomaCore/Foundation/library/includes/TTFoundation.h:
:In file included from 14/Users/WALL-E/Documents/Developpements/Jamoma/Max/JamomaCore/Score/library/includes/TTScore.h:
:21:
/Users/WALL-E/Documents/Developpements/Jamoma/Max/source/c74support/max-includes/common/commonsyms.cpp:4:10: fatal error: /Users/WALL-E/Documents/Developpements/Jamoma/Max/JamomaCore/Foundation/library/includes/TTBase.h:/Users/WALL-E/Documents/Developpements/Jamoma/Max/JamomaCore/Foundation/library/includes/TTBase.h/Users/WALL-E/Documents/Developpements/Jamoma/Max/JamomaCore/Foundation/library/includes/TTBase.h24::/Users/WALL-E/Documents/Developpements/Jamoma/Max/JamomaCore/Score/library/includes/TTScoreIncludes.h:242411'Carbon/Carbon.h'::: 42 file11: :not11fatal error ::: found10 :
  'TargetConditionals.h' fatal errorfile:  fatal errornotfatal error : : found'TargetConditionals.h' 
'TargetConditionals.h'file'math.h'   filenotfile   notnotfound  foundfound


        #include "TargetConditionals.h"        #include "TargetConditionals.h"
        #include "TargetConditionals.h"

#include <math.h>                 ^#include <Carbon/Carbon.h>                 ^



                 ^         ^

         ^
In file included from In file included from /Users/WALL-E/Documents/Developpements/Jamoma/Max/source/classwrapper/MaxAudioGraph.cpp/Users/WALL-E/Documents/Developpements/Jamoma/Max/source/classwrapper/TTClassWrapperMax.cpp::1710:
:
In file included from In file included from /Users/WALL-E/Documents/Developpements/Jamoma/Max/source/classwrapper/MaxAudioGraph.h/Users/WALL-E/Documents/Developpements/Jamoma/Max/source/classwrapper/TTClassWrapperMax.h::2013:
:
In file included from In file included from /Users/WALL-E/Documents/Developpements/Jamoma/Max/source/c74support/max-includes/ext.h/Users/WALL-E/Documents/Developpements/Jamoma/Max/source/c74support/max-includes/ext.h::2020:
:
/Users/WALL-E/Documents/Developpements/Jamoma/Max/source/c74support/max-includes/ext_prefix.h/Users/WALL-E/Documents/Developpements/Jamoma/Max/source/c74support/max-includes/ext_prefix.h::147147::10:10 : fatal error: fatal error: 'MacTypes.h''MacTypes.h'  filefile  notnot  foundfound

In file included from #include <MacTypes.h>#include <MacTypes.h>

/Users/WALL-E/Documents/Developpements/Jamoma/Max/source/classwrapper/TTModularClassWrapperMax.cpp:         ^         ^10

:
In file included from /Users/WALL-E/Documents/Developpements/Jamoma/Max/source/classwrapper/TTModularClassWrapperMax.h:20:
In file included from /Users/WALL-E/Documents/Developpements/Jamoma/Max/source/c74support/max-includes/ext.h:20:
/Users/WALL-E/Documents/Developpements/Jamoma/Max/source/c74support/max-includes/ext_prefix.h:147:10: fatal error: 'MacTypes.h' file not found
#include <MacTypes.h>
         ^
1 error generated.
make[2]: *** [source/CMakeFiles/MaxCommonSyms.dir/c74support/max-includes/common/commonsyms.cpp.o] Error 1
make[1]: *** [source/CMakeFiles/MaxCommonSyms.dir/all] Error 2
make[1]: *** Waiting for unfinished jobs....
[  2%] Building CXX object JamomaCore/Foundation/library/CMakeFiles/Foundation.dir/source/TTCallback.cpp.o
In file included from /Users/WALL-E/Documents/Developpements/Jamoma/Max/JamomaCore/Foundation/library/source/TTCallback.cpp:18:
In file included from /Users/WALL-E/Documents/Developpements/Jamoma/Max/JamomaCore/Foundation/library/includes/TTCallback.h:21:
In file included from /Users/WALL-E/Documents/Developpements/Jamoma/Max/JamomaCore/Foundation/library/includes/TTFoundationAPI.h:13:
In file included from /Users/WALL-E/Documents/Developpements/Jamoma/Max/JamomaCore/Foundation/library/includes/TTFoundation.h:14:
/Users/WALL-E/Documents/Developpements/Jamoma/Max/JamomaCore/Foundation/library/includes/TTBase.h:24:11: fatal error: 'TargetConditionals.h' file not found
        #include "TargetConditionals.h"
                 ^
1 error generated.
1 error generated.
make[2]: *** [JamomaCore/Foundation/library/CMakeFiles/Foundation.dir/source/TTCallback.cpp.o] Error 1
make[2]: *** Waiting for unfinished jobs....
make[2]: *** [JamomaCore/Modular/library/CMakeFiles/TTClock.dir/source/TTClock.cpp.o] Error 1
make[1]: *** [JamomaCore/Modular/library/CMakeFiles/TTClock.dir/all] Error 2
1 error generated.
make[2]: *** [JamomaCore/Modular/library/CMakeFiles/TTProtocol.dir/source/TTProtocol.cpp.o] Error 1
make[1]: *** [JamomaCore/Modular/library/CMakeFiles/TTProtocol.dir/all] Error 2
[  2%] Building CXX object source/CMakeFiles/MaxAudioGraph.dir/classwrapper/MaxGraph.cpp.o
1 error generated.
make[2]: *** [JamomaCore/Foundation/library/CMakeFiles/Foundation.dir/source/TTFoundation.cpp.o] Error 1
make[1]: *** [JamomaCore/Foundation/library/CMakeFiles/Foundation.dir/all] Error 2
In file included from /Users/WALL-E/Documents/Developpements/Jamoma/Max/source/classwrapper/MaxGraph.cpp:11:
In file included from /Users/WALL-E/Documents/Developpements/Jamoma/Max/source/classwrapper/MaxGraph.h:14:
In file included from /Users/WALL-E/Documents/Developpements/Jamoma/Max/source/c74support/max-includes/ext.h:20:
/Users/WALL-E/Documents/Developpements/Jamoma/Max/source/c74support/max-includes/ext_prefix.h:147:10: fatal error: 'MacTypes.h' file not found
#include <MacTypes.h>
         ^
1 error generated.
make[2]: *** [source/CMakeFiles/TTModularClassWrapperMax.dir/classwrapper/TTModularClassWrapperMax.cpp.o] Error 1
make[1]: *** [source/CMakeFiles/TTModularClassWrapperMax.dir/all] Error 2
1 error generated.
make[2]: *** [JamomaCore/Score/CMakeFiles/TimePluginLib.dir/extensions/TimePluginLib.cpp.o] Error 1
make[1]: *** [JamomaCore/Score/CMakeFiles/TimePluginLib.dir/all] Error 2
1 error generated.
1 error generated.
make[2]: *** [source/CMakeFiles/MaxAudioGraph.dir/classwrapper/MaxAudioGraph.cpp.o] Error 1
make[2]: *** Waiting for unfinished jobs....
make[2]: *** [source/CMakeFiles/TTClassWrapperMax.dir/classwrapper/TTClassWrapperMax.cpp.o] Error 1
make[1]: *** [source/CMakeFiles/TTClassWrapperMax.dir/all] Error 2
1 error generated.
make[2]: *** [source/CMakeFiles/MaxAudioGraph.dir/classwrapper/MaxGraph.cpp.o] Error 1
make[1]: *** [source/CMakeFiles/MaxAudioGraph.dir/all] Error 2
make: *** [all] Error 2
wall-e:Max WALL-E$

------------------------------------------------------------------------------

_______________________________________________
Jamoma-devel mailing list
[hidden email]
https://lists.sourceforge.net/lists/listinfo/jamoma-devel



------------------------------------------------------------------------------

_______________________________________________
Jamoma-devel mailing list
[hidden email]
https://lists.sourceforge.net/lists/listinfo/jamoma-devel
Reply | Threaded
Open this post in threaded view
|  
Report Content as Inappropriate

Re: build under Max OS X El Capitan fails

Théo de la Hogue-2
Hi Antoine !
here is the output with make only :

[  0%] Building CXX object JamomaCore/Foundation/library/CMakeFiles/Foundation.dir/source/TTFoundation.cpp.o
In file included from /Users/WALL-E/Documents/Developpements/Jamoma/Max/JamomaCore/Foundation/library/source/TTFoundation.cpp:9:
In file included from /Users/WALL-E/Documents/Developpements/Jamoma/Max/JamomaCore/Foundation/library/includes/TTFoundation.h:14:
/Users/WALL-E/Documents/Developpements/Jamoma/Max/JamomaCore/Foundation/library/includes/TTBase.h:24:11: fatal error: 'TargetConditionals.h' file not found
        #include "TargetConditionals.h"
                 ^
1 error generated.
make[2]: *** [JamomaCore/Foundation/library/CMakeFiles/Foundation.dir/source/TTFoundation.cpp.o] Error 1
make[1]: *** [JamomaCore/Foundation/library/CMakeFiles/Foundation.dir/all] Error 2
make: *** [all] Error 2

I'm connected on skype if you need me to test things.
thanks for your help !

Best,
TO

Le 2 oct. 2015 à 12:02, Antoine Villeret <[hidden email]> a écrit :

hi theo, 

seems that some file are not found.

could re-run make without -j 8 option ?
-j 8 causes error message to be scramble all together and not easily readable.

best

Antoine

--
do it yourself                      
http://antoine.villeret.free.fr

2015-10-02 11:54 GMT+02:00 Théo de la Hogue <[hidden email]>:
Hi all,
just to warn you that JamomaMax no longer builds under the last Mac OS X version.

here is my console output (after having configured and generated CMake files).

is anyone have an idea how to fix this ?

Best,
TO

wall-e:Max WALL-E$ make clean
wall-e:Max WALL-E$ make -j 8
Scanning dependencies of target MaxCommonSyms
Scanning dependencies of target TTClassWrapperMax
Scanning dependencies of target TTModularClassWrapperMax
[  0%] Building CXX object JamomaCore/Modular/library/CMakeFiles/TTProtocol.dir/source/TTProtocol.cpp.o
[  1%] Building CXX object JamomaCore/Modular/library/CMakeFiles/TTClock.dir/source/TTClock.cpp.o
[  1%] Building CXX object JamomaCore/Score/CMakeFiles/TimePluginLib.dir/extensions/TimePluginLib.cpp.o
Scanning dependencies of target MaxAudioGraph
[  1%] Building CXX object source/CMakeFiles/MaxCommonSyms.dir/c74support/max-includes/common/commonsyms.cpp.o
[  1%] Building CXX object source/CMakeFiles/TTClassWrapperMax.dir/classwrapper/TTClassWrapperMax.cpp.o
[  1%] Building CXX object source/CMakeFiles/TTModularClassWrapperMax.dir/classwrapper/TTModularClassWrapperMax.cpp.o
[  1%] Building CXX object JamomaCore/Foundation/library/CMakeFiles/Foundation.dir/source/TTFoundation.cpp.o
[  2%] Building CXX object source/CMakeFiles/MaxAudioGraph.dir/classwrapper/MaxAudioGraph.cpp.o
In file included from In file included from In file included from /Users/WALL-E/Documents/Developpements/Jamoma/Max/JamomaCore/Foundation/library/source/TTFoundation.cppIn file included from :9:
/Users/WALL-E/Documents/Developpements/Jamoma/Max/JamomaCore/Score/extensions/TimePluginLib.cppIn file included from /Users/WALL-E/Documents/Developpements/Jamoma/Max/JamomaCore/Modular/library/source/TTProtocol.cpp/Users/WALL-E/Documents/Developpements/Jamoma/Max/JamomaCore/Foundation/library/includes/TTFoundation.h::1714:
:
/Users/WALL-E/Documents/Developpements/Jamoma/Max/JamomaCore/Modular/library/source/TTClock.cppIn file included from :/Users/WALL-E/Documents/Developpements/Jamoma/Max/JamomaCore/Modular/library/includes/TTProtocol.h17::
20In file included from :
/Users/WALL-E/Documents/Developpements/Jamoma/Max/JamomaCore/Modular/library/includes/TTClock.hIn file included from ::20/Users/WALL-E/Documents/Developpements/Jamoma/Max/JamomaCore/Foundation/library/includes/TTFoundationAPI.h16:
::
In file included from 13In file included from /Users/WALL-E/Documents/Developpements/Jamoma/Max/JamomaCore/Foundation/library/includes/TTFoundationAPI.h:
:/Users/WALL-E/Documents/Developpements/Jamoma/Max/JamomaCore/Score/extensions/TimePluginLib.hIn file included from 13:/Users/WALL-E/Documents/Developpements/Jamoma/Max/JamomaCore/Foundation/library/includes/TTFoundation.h:
21:In file included from :
14/Users/WALL-E/Documents/Developpements/Jamoma/Max/JamomaCore/Foundation/library/includes/TTFoundation.h:
:In file included from 14/Users/WALL-E/Documents/Developpements/Jamoma/Max/JamomaCore/Score/library/includes/TTScore.h:
:21:
/Users/WALL-E/Documents/Developpements/Jamoma/Max/source/c74support/max-includes/common/commonsyms.cpp:4:10: fatal error: /Users/WALL-E/Documents/Developpements/Jamoma/Max/JamomaCore/Foundation/library/includes/TTBase.h:/Users/WALL-E/Documents/Developpements/Jamoma/Max/JamomaCore/Foundation/library/includes/TTBase.h/Users/WALL-E/Documents/Developpements/Jamoma/Max/JamomaCore/Foundation/library/includes/TTBase.h24::/Users/WALL-E/Documents/Developpements/Jamoma/Max/JamomaCore/Score/library/includes/TTScoreIncludes.h:242411'Carbon/Carbon.h'::: 42 file11: :not11fatal error ::: found10 :
  'TargetConditionals.h' fatal errorfile:  fatal errornotfatal error : : found'TargetConditionals.h' 
'TargetConditionals.h'file'math.h'   filenotfile   notnotfound  foundfound


        #include "TargetConditionals.h"        #include "TargetConditionals.h"
        #include "TargetConditionals.h"

#include <math.h>                 ^#include <Carbon/Carbon.h>                 ^



                 ^         ^

         ^
In file included from In file included from /Users/WALL-E/Documents/Developpements/Jamoma/Max/source/classwrapper/MaxAudioGraph.cpp/Users/WALL-E/Documents/Developpements/Jamoma/Max/source/classwrapper/TTClassWrapperMax.cpp::1710:
:
In file included from In file included from /Users/WALL-E/Documents/Developpements/Jamoma/Max/source/classwrapper/MaxAudioGraph.h/Users/WALL-E/Documents/Developpements/Jamoma/Max/source/classwrapper/TTClassWrapperMax.h::2013:
:
In file included from In file included from /Users/WALL-E/Documents/Developpements/Jamoma/Max/source/c74support/max-includes/ext.h/Users/WALL-E/Documents/Developpements/Jamoma/Max/source/c74support/max-includes/ext.h::2020:
:
/Users/WALL-E/Documents/Developpements/Jamoma/Max/source/c74support/max-includes/ext_prefix.h/Users/WALL-E/Documents/Developpements/Jamoma/Max/source/c74support/max-includes/ext_prefix.h::147147::10:10 : fatal error: fatal error: 'MacTypes.h''MacTypes.h'  filefile  notnot  foundfound

In file included from #include <MacTypes.h>#include <MacTypes.h>

/Users/WALL-E/Documents/Developpements/Jamoma/Max/source/classwrapper/TTModularClassWrapperMax.cpp:         ^         ^10

:
In file included from /Users/WALL-E/Documents/Developpements/Jamoma/Max/source/classwrapper/TTModularClassWrapperMax.h:20:
In file included from /Users/WALL-E/Documents/Developpements/Jamoma/Max/source/c74support/max-includes/ext.h:20:
/Users/WALL-E/Documents/Developpements/Jamoma/Max/source/c74support/max-includes/ext_prefix.h:147:10: fatal error: 'MacTypes.h' file not found
#include <MacTypes.h>
         ^
1 error generated.
make[2]: *** [source/CMakeFiles/MaxCommonSyms.dir/c74support/max-includes/common/commonsyms.cpp.o] Error 1
make[1]: *** [source/CMakeFiles/MaxCommonSyms.dir/all] Error 2
make[1]: *** Waiting for unfinished jobs....
[  2%] Building CXX object JamomaCore/Foundation/library/CMakeFiles/Foundation.dir/source/TTCallback.cpp.o
In file included from /Users/WALL-E/Documents/Developpements/Jamoma/Max/JamomaCore/Foundation/library/source/TTCallback.cpp:18:
In file included from /Users/WALL-E/Documents/Developpements/Jamoma/Max/JamomaCore/Foundation/library/includes/TTCallback.h:21:
In file included from /Users/WALL-E/Documents/Developpements/Jamoma/Max/JamomaCore/Foundation/library/includes/TTFoundationAPI.h:13:
In file included from /Users/WALL-E/Documents/Developpements/Jamoma/Max/JamomaCore/Foundation/library/includes/TTFoundation.h:14:
/Users/WALL-E/Documents/Developpements/Jamoma/Max/JamomaCore/Foundation/library/includes/TTBase.h:24:11: fatal error: 'TargetConditionals.h' file not found
        #include "TargetConditionals.h"
                 ^
1 error generated.
1 error generated.
make[2]: *** [JamomaCore/Foundation/library/CMakeFiles/Foundation.dir/source/TTCallback.cpp.o] Error 1
make[2]: *** Waiting for unfinished jobs....
make[2]: *** [JamomaCore/Modular/library/CMakeFiles/TTClock.dir/source/TTClock.cpp.o] Error 1
make[1]: *** [JamomaCore/Modular/library/CMakeFiles/TTClock.dir/all] Error 2
1 error generated.
make[2]: *** [JamomaCore/Modular/library/CMakeFiles/TTProtocol.dir/source/TTProtocol.cpp.o] Error 1
make[1]: *** [JamomaCore/Modular/library/CMakeFiles/TTProtocol.dir/all] Error 2
[  2%] Building CXX object source/CMakeFiles/MaxAudioGraph.dir/classwrapper/MaxGraph.cpp.o
1 error generated.
make[2]: *** [JamomaCore/Foundation/library/CMakeFiles/Foundation.dir/source/TTFoundation.cpp.o] Error 1
make[1]: *** [JamomaCore/Foundation/library/CMakeFiles/Foundation.dir/all] Error 2
In file included from /Users/WALL-E/Documents/Developpements/Jamoma/Max/source/classwrapper/MaxGraph.cpp:11:
In file included from /Users/WALL-E/Documents/Developpements/Jamoma/Max/source/classwrapper/MaxGraph.h:14:
In file included from /Users/WALL-E/Documents/Developpements/Jamoma/Max/source/c74support/max-includes/ext.h:20:
/Users/WALL-E/Documents/Developpements/Jamoma/Max/source/c74support/max-includes/ext_prefix.h:147:10: fatal error: 'MacTypes.h' file not found
#include <MacTypes.h>
         ^
1 error generated.
make[2]: *** [source/CMakeFiles/TTModularClassWrapperMax.dir/classwrapper/TTModularClassWrapperMax.cpp.o] Error 1
make[1]: *** [source/CMakeFiles/TTModularClassWrapperMax.dir/all] Error 2
1 error generated.
make[2]: *** [JamomaCore/Score/CMakeFiles/TimePluginLib.dir/extensions/TimePluginLib.cpp.o] Error 1
make[1]: *** [JamomaCore/Score/CMakeFiles/TimePluginLib.dir/all] Error 2
1 error generated.
1 error generated.
make[2]: *** [source/CMakeFiles/MaxAudioGraph.dir/classwrapper/MaxAudioGraph.cpp.o] Error 1
make[2]: *** Waiting for unfinished jobs....
make[2]: *** [source/CMakeFiles/TTClassWrapperMax.dir/classwrapper/TTClassWrapperMax.cpp.o] Error 1
make[1]: *** [source/CMakeFiles/TTClassWrapperMax.dir/all] Error 2
1 error generated.
make[2]: *** [source/CMakeFiles/MaxAudioGraph.dir/classwrapper/MaxGraph.cpp.o] Error 1
make[1]: *** [source/CMakeFiles/MaxAudioGraph.dir/all] Error 2
make: *** [all] Error 2
wall-e:Max WALL-E$

------------------------------------------------------------------------------

_______________________________________________
Jamoma-devel mailing list
[hidden email]
https://lists.sourceforge.net/lists/listinfo/jamoma-devel


------------------------------------------------------------------------------
_______________________________________________
Jamoma-devel mailing list
[hidden email]
https://lists.sourceforge.net/lists/listinfo/jamoma-devel


------------------------------------------------------------------------------

_______________________________________________
Jamoma-devel mailing list
[hidden email]
https://lists.sourceforge.net/lists/listinfo/jamoma-devel
Reply | Threaded
Open this post in threaded view
|  
Report Content as Inappropriate

Re: build under Max OS X El Capitan fails

Trond Lossius
Administrator
In reply to this post by Théo de la Hogue-2
Hi Theo,

I haven't updated to El Capitan yet, but I've updated Xcode. Xcode 7 deletes the sdks for all older Osx versions, so I afterwards had to go inside the Xcode app package, and use TimeMachine ti recover the sdks for 19.10 and 10.9.

Unless you have already dine this, it might be worth a try.

Best,
Trond

Sorry for the typing errors, blame my iPhone

On 2. okt. 2015, at 11.54, Théo de la Hogue <[hidden email]> wrote:

Hi all,
just to warn you that JamomaMax no longer builds under the last Mac OS X version.

here is my console output (after having configured and generated CMake files).

is anyone have an idea how to fix this ?

Best,
TO

wall-e:Max WALL-E$ make clean
wall-e:Max WALL-E$ make -j 8
Scanning dependencies of target MaxCommonSyms
Scanning dependencies of target TTClassWrapperMax
Scanning dependencies of target TTModularClassWrapperMax
[  0%] Building CXX object JamomaCore/Modular/library/CMakeFiles/TTProtocol.dir/source/TTProtocol.cpp.o
[  1%] Building CXX object JamomaCore/Modular/library/CMakeFiles/TTClock.dir/source/TTClock.cpp.o
[  1%] Building CXX object JamomaCore/Score/CMakeFiles/TimePluginLib.dir/extensions/TimePluginLib.cpp.o
Scanning dependencies of target MaxAudioGraph
[  1%] Building CXX object source/CMakeFiles/MaxCommonSyms.dir/c74support/max-includes/common/commonsyms.cpp.o
[  1%] Building CXX object source/CMakeFiles/TTClassWrapperMax.dir/classwrapper/TTClassWrapperMax.cpp.o
[  1%] Building CXX object source/CMakeFiles/TTModularClassWrapperMax.dir/classwrapper/TTModularClassWrapperMax.cpp.o
[  1%] Building CXX object JamomaCore/Foundation/library/CMakeFiles/Foundation.dir/source/TTFoundation.cpp.o
[  2%] Building CXX object source/CMakeFiles/MaxAudioGraph.dir/classwrapper/MaxAudioGraph.cpp.o
In file included from In file included from In file included from /Users/WALL-E/Documents/Developpements/Jamoma/Max/JamomaCore/Foundation/library/source/TTFoundation.cppIn file included from :9:
/Users/WALL-E/Documents/Developpements/Jamoma/Max/JamomaCore/Score/extensions/TimePluginLib.cppIn file included from /Users/WALL-E/Documents/Developpements/Jamoma/Max/JamomaCore/Modular/library/source/TTProtocol.cpp/Users/WALL-E/Documents/Developpements/Jamoma/Max/JamomaCore/Foundation/library/includes/TTFoundation.h::1714:
:
/Users/WALL-E/Documents/Developpements/Jamoma/Max/JamomaCore/Modular/library/source/TTClock.cppIn file included from :/Users/WALL-E/Documents/Developpements/Jamoma/Max/JamomaCore/Modular/library/includes/TTProtocol.h17::
20In file included from :
/Users/WALL-E/Documents/Developpements/Jamoma/Max/JamomaCore/Modular/library/includes/TTClock.hIn file included from ::20/Users/WALL-E/Documents/Developpements/Jamoma/Max/JamomaCore/Foundation/library/includes/TTFoundationAPI.h16:
::
In file included from 13In file included from /Users/WALL-E/Documents/Developpements/Jamoma/Max/JamomaCore/Foundation/library/includes/TTFoundationAPI.h:
:/Users/WALL-E/Documents/Developpements/Jamoma/Max/JamomaCore/Score/extensions/TimePluginLib.hIn file included from 13:/Users/WALL-E/Documents/Developpements/Jamoma/Max/JamomaCore/Foundation/library/includes/TTFoundation.h:
21:In file included from :
14/Users/WALL-E/Documents/Developpements/Jamoma/Max/JamomaCore/Foundation/library/includes/TTFoundation.h:
:In file included from 14/Users/WALL-E/Documents/Developpements/Jamoma/Max/JamomaCore/Score/library/includes/TTScore.h:
:21:
/Users/WALL-E/Documents/Developpements/Jamoma/Max/source/c74support/max-includes/common/commonsyms.cpp:4:10: fatal error: /Users/WALL-E/Documents/Developpements/Jamoma/Max/JamomaCore/Foundation/library/includes/TTBase.h:/Users/WALL-E/Documents/Developpements/Jamoma/Max/JamomaCore/Foundation/library/includes/TTBase.h/Users/WALL-E/Documents/Developpements/Jamoma/Max/JamomaCore/Foundation/library/includes/TTBase.h24::/Users/WALL-E/Documents/Developpements/Jamoma/Max/JamomaCore/Score/library/includes/TTScoreIncludes.h:242411'Carbon/Carbon.h'::: 42 file11: :not11fatal error ::: found10 :
  'TargetConditionals.h' fatal errorfile:  fatal errornotfatal error : : found'TargetConditionals.h' 
'TargetConditionals.h'file'math.h'   filenotfile   notnotfound  foundfound


        #include "TargetConditionals.h"        #include "TargetConditionals.h"
        #include "TargetConditionals.h"

#include <math.h>                 ^#include <Carbon/Carbon.h>                 ^



                 ^         ^

         ^
In file included from In file included from /Users/WALL-E/Documents/Developpements/Jamoma/Max/source/classwrapper/MaxAudioGraph.cpp/Users/WALL-E/Documents/Developpements/Jamoma/Max/source/classwrapper/TTClassWrapperMax.cpp::1710:
:
In file included from In file included from /Users/WALL-E/Documents/Developpements/Jamoma/Max/source/classwrapper/MaxAudioGraph.h/Users/WALL-E/Documents/Developpements/Jamoma/Max/source/classwrapper/TTClassWrapperMax.h::2013:
:
In file included from In file included from /Users/WALL-E/Documents/Developpements/Jamoma/Max/source/c74support/max-includes/ext.h/Users/WALL-E/Documents/Developpements/Jamoma/Max/source/c74support/max-includes/ext.h::2020:
:
/Users/WALL-E/Documents/Developpements/Jamoma/Max/source/c74support/max-includes/ext_prefix.h/Users/WALL-E/Documents/Developpements/Jamoma/Max/source/c74support/max-includes/ext_prefix.h::147147::10:10 : fatal error: fatal error: 'MacTypes.h''MacTypes.h'  filefile  notnot  foundfound

In file included from #include <MacTypes.h>#include <MacTypes.h>

/Users/WALL-E/Documents/Developpements/Jamoma/Max/source/classwrapper/TTModularClassWrapperMax.cpp:         ^         ^10

:
In file included from /Users/WALL-E/Documents/Developpements/Jamoma/Max/source/classwrapper/TTModularClassWrapperMax.h:20:
In file included from /Users/WALL-E/Documents/Developpements/Jamoma/Max/source/c74support/max-includes/ext.h:20:
/Users/WALL-E/Documents/Developpements/Jamoma/Max/source/c74support/max-includes/ext_prefix.h:147:10: fatal error: 'MacTypes.h' file not found
#include <MacTypes.h>
         ^
1 error generated.
make[2]: *** [source/CMakeFiles/MaxCommonSyms.dir/c74support/max-includes/common/commonsyms.cpp.o] Error 1
make[1]: *** [source/CMakeFiles/MaxCommonSyms.dir/all] Error 2
make[1]: *** Waiting for unfinished jobs....
[  2%] Building CXX object JamomaCore/Foundation/library/CMakeFiles/Foundation.dir/source/TTCallback.cpp.o
In file included from /Users/WALL-E/Documents/Developpements/Jamoma/Max/JamomaCore/Foundation/library/source/TTCallback.cpp:18:
In file included from /Users/WALL-E/Documents/Developpements/Jamoma/Max/JamomaCore/Foundation/library/includes/TTCallback.h:21:
In file included from /Users/WALL-E/Documents/Developpements/Jamoma/Max/JamomaCore/Foundation/library/includes/TTFoundationAPI.h:13:
In file included from /Users/WALL-E/Documents/Developpements/Jamoma/Max/JamomaCore/Foundation/library/includes/TTFoundation.h:14:
/Users/WALL-E/Documents/Developpements/Jamoma/Max/JamomaCore/Foundation/library/includes/TTBase.h:24:11: fatal error: 'TargetConditionals.h' file not found
        #include "TargetConditionals.h"
                 ^
1 error generated.
1 error generated.
make[2]: *** [JamomaCore/Foundation/library/CMakeFiles/Foundation.dir/source/TTCallback.cpp.o] Error 1
make[2]: *** Waiting for unfinished jobs....
make[2]: *** [JamomaCore/Modular/library/CMakeFiles/TTClock.dir/source/TTClock.cpp.o] Error 1
make[1]: *** [JamomaCore/Modular/library/CMakeFiles/TTClock.dir/all] Error 2
1 error generated.
make[2]: *** [JamomaCore/Modular/library/CMakeFiles/TTProtocol.dir/source/TTProtocol.cpp.o] Error 1
make[1]: *** [JamomaCore/Modular/library/CMakeFiles/TTProtocol.dir/all] Error 2
[  2%] Building CXX object source/CMakeFiles/MaxAudioGraph.dir/classwrapper/MaxGraph.cpp.o
1 error generated.
make[2]: *** [JamomaCore/Foundation/library/CMakeFiles/Foundation.dir/source/TTFoundation.cpp.o] Error 1
make[1]: *** [JamomaCore/Foundation/library/CMakeFiles/Foundation.dir/all] Error 2
In file included from /Users/WALL-E/Documents/Developpements/Jamoma/Max/source/classwrapper/MaxGraph.cpp:11:
In file included from /Users/WALL-E/Documents/Developpements/Jamoma/Max/source/classwrapper/MaxGraph.h:14:
In file included from /Users/WALL-E/Documents/Developpements/Jamoma/Max/source/c74support/max-includes/ext.h:20:
/Users/WALL-E/Documents/Developpements/Jamoma/Max/source/c74support/max-includes/ext_prefix.h:147:10: fatal error: 'MacTypes.h' file not found
#include <MacTypes.h>
         ^
1 error generated.
make[2]: *** [source/CMakeFiles/TTModularClassWrapperMax.dir/classwrapper/TTModularClassWrapperMax.cpp.o] Error 1
make[1]: *** [source/CMakeFiles/TTModularClassWrapperMax.dir/all] Error 2
1 error generated.
make[2]: *** [JamomaCore/Score/CMakeFiles/TimePluginLib.dir/extensions/TimePluginLib.cpp.o] Error 1
make[1]: *** [JamomaCore/Score/CMakeFiles/TimePluginLib.dir/all] Error 2
1 error generated.
1 error generated.
make[2]: *** [source/CMakeFiles/MaxAudioGraph.dir/classwrapper/MaxAudioGraph.cpp.o] Error 1
make[2]: *** Waiting for unfinished jobs....
make[2]: *** [source/CMakeFiles/TTClassWrapperMax.dir/classwrapper/TTClassWrapperMax.cpp.o] Error 1
make[1]: *** [source/CMakeFiles/TTClassWrapperMax.dir/all] Error 2
1 error generated.
make[2]: *** [source/CMakeFiles/MaxAudioGraph.dir/classwrapper/MaxGraph.cpp.o] Error 1
make[1]: *** [source/CMakeFiles/MaxAudioGraph.dir/all] Error 2
make: *** [all] Error 2
wall-e:Max WALL-E$
------------------------------------------------------------------------------
_______________________________________________
Jamoma-devel mailing list
[hidden email]
https://lists.sourceforge.net/lists/listinfo/jamoma-devel

------------------------------------------------------------------------------

_______________________________________________
Jamoma-devel mailing list
[hidden email]
https://lists.sourceforge.net/lists/listinfo/jamoma-devel
Reply | Threaded
Open this post in threaded view
|  
Report Content as Inappropriate

Re: build under Max OS X El Capitan fails

Antoine Villeret
In reply to this post by Théo de la Hogue-2
thanks for the report, 
so it seems that you missed TargetConditionals.h and can't say more, sorry :-(
sounds like Apple removed that file when updating...

as a quick fix you can find it there : 

good luck

antoine

--
do it yourself                      
http://antoine.villeret.free.fr

2015-10-02 12:15 GMT+02:00 Théo de la Hogue <[hidden email]>:
Hi Antoine !
here is the output with make only :

[  0%] Building CXX object JamomaCore/Foundation/library/CMakeFiles/Foundation.dir/source/TTFoundation.cpp.o
In file included from /Users/WALL-E/Documents/Developpements/Jamoma/Max/JamomaCore/Foundation/library/source/TTFoundation.cpp:9:
In file included from /Users/WALL-E/Documents/Developpements/Jamoma/Max/JamomaCore/Foundation/library/includes/TTFoundation.h:14:
/Users/WALL-E/Documents/Developpements/Jamoma/Max/JamomaCore/Foundation/library/includes/TTBase.h:24:11: fatal error: 'TargetConditionals.h' file not found
        #include "TargetConditionals.h"
                 ^
1 error generated.
make[2]: *** [JamomaCore/Foundation/library/CMakeFiles/Foundation.dir/source/TTFoundation.cpp.o] Error 1
make[1]: *** [JamomaCore/Foundation/library/CMakeFiles/Foundation.dir/all] Error 2
make: *** [all] Error 2

I'm connected on skype if you need me to test things.
thanks for your help !

Best,
TO

Le 2 oct. 2015 à 12:02, Antoine Villeret <[hidden email]> a écrit :

hi theo, 

seems that some file are not found.

could re-run make without -j 8 option ?
-j 8 causes error message to be scramble all together and not easily readable.

best

Antoine

--
do it yourself                      
http://antoine.villeret.free.fr

2015-10-02 11:54 GMT+02:00 Théo de la Hogue <[hidden email]>:
Hi all,
just to warn you that JamomaMax no longer builds under the last Mac OS X version.

here is my console output (after having configured and generated CMake files).

is anyone have an idea how to fix this ?

Best,
TO

wall-e:Max WALL-E$ make clean
wall-e:Max WALL-E$ make -j 8
Scanning dependencies of target MaxCommonSyms
Scanning dependencies of target TTClassWrapperMax
Scanning dependencies of target TTModularClassWrapperMax
[  0%] Building CXX object JamomaCore/Modular/library/CMakeFiles/TTProtocol.dir/source/TTProtocol.cpp.o
[  1%] Building CXX object JamomaCore/Modular/library/CMakeFiles/TTClock.dir/source/TTClock.cpp.o
[  1%] Building CXX object JamomaCore/Score/CMakeFiles/TimePluginLib.dir/extensions/TimePluginLib.cpp.o
Scanning dependencies of target MaxAudioGraph
[  1%] Building CXX object source/CMakeFiles/MaxCommonSyms.dir/c74support/max-includes/common/commonsyms.cpp.o
[  1%] Building CXX object source/CMakeFiles/TTClassWrapperMax.dir/classwrapper/TTClassWrapperMax.cpp.o
[  1%] Building CXX object source/CMakeFiles/TTModularClassWrapperMax.dir/classwrapper/TTModularClassWrapperMax.cpp.o
[  1%] Building CXX object JamomaCore/Foundation/library/CMakeFiles/Foundation.dir/source/TTFoundation.cpp.o
[  2%] Building CXX object source/CMakeFiles/MaxAudioGraph.dir/classwrapper/MaxAudioGraph.cpp.o
In file included from In file included from In file included from /Users/WALL-E/Documents/Developpements/Jamoma/Max/JamomaCore/Foundation/library/source/TTFoundation.cppIn file included from :9:
/Users/WALL-E/Documents/Developpements/Jamoma/Max/JamomaCore/Score/extensions/TimePluginLib.cppIn file included from /Users/WALL-E/Documents/Developpements/Jamoma/Max/JamomaCore/Modular/library/source/TTProtocol.cpp/Users/WALL-E/Documents/Developpements/Jamoma/Max/JamomaCore/Foundation/library/includes/TTFoundation.h::1714:
:
/Users/WALL-E/Documents/Developpements/Jamoma/Max/JamomaCore/Modular/library/source/TTClock.cppIn file included from :/Users/WALL-E/Documents/Developpements/Jamoma/Max/JamomaCore/Modular/library/includes/TTProtocol.h17::
20In file included from :
/Users/WALL-E/Documents/Developpements/Jamoma/Max/JamomaCore/Modular/library/includes/TTClock.hIn file included from ::20/Users/WALL-E/Documents/Developpements/Jamoma/Max/JamomaCore/Foundation/library/includes/TTFoundationAPI.h16:
::
In file included from 13In file included from /Users/WALL-E/Documents/Developpements/Jamoma/Max/JamomaCore/Foundation/library/includes/TTFoundationAPI.h:
:/Users/WALL-E/Documents/Developpements/Jamoma/Max/JamomaCore/Score/extensions/TimePluginLib.hIn file included from 13:/Users/WALL-E/Documents/Developpements/Jamoma/Max/JamomaCore/Foundation/library/includes/TTFoundation.h:
21:In file included from :
14/Users/WALL-E/Documents/Developpements/Jamoma/Max/JamomaCore/Foundation/library/includes/TTFoundation.h:
:In file included from 14/Users/WALL-E/Documents/Developpements/Jamoma/Max/JamomaCore/Score/library/includes/TTScore.h:
:21:
/Users/WALL-E/Documents/Developpements/Jamoma/Max/source/c74support/max-includes/common/commonsyms.cpp:4:10: fatal error: /Users/WALL-E/Documents/Developpements/Jamoma/Max/JamomaCore/Foundation/library/includes/TTBase.h:/Users/WALL-E/Documents/Developpements/Jamoma/Max/JamomaCore/Foundation/library/includes/TTBase.h/Users/WALL-E/Documents/Developpements/Jamoma/Max/JamomaCore/Foundation/library/includes/TTBase.h24::/Users/WALL-E/Documents/Developpements/Jamoma/Max/JamomaCore/Score/library/includes/TTScoreIncludes.h:242411'Carbon/Carbon.h'::: 42 file11: :not11fatal error ::: found10 :
  'TargetConditionals.h' fatal errorfile:  fatal errornotfatal error : : found'TargetConditionals.h' 
'TargetConditionals.h'file'math.h'   filenotfile   notnotfound  foundfound


        #include "TargetConditionals.h"        #include "TargetConditionals.h"
        #include "TargetConditionals.h"

#include <math.h>                 ^#include <Carbon/Carbon.h>                 ^



                 ^         ^

         ^
In file included from In file included from /Users/WALL-E/Documents/Developpements/Jamoma/Max/source/classwrapper/MaxAudioGraph.cpp/Users/WALL-E/Documents/Developpements/Jamoma/Max/source/classwrapper/TTClassWrapperMax.cpp::1710:
:
In file included from In file included from /Users/WALL-E/Documents/Developpements/Jamoma/Max/source/classwrapper/MaxAudioGraph.h/Users/WALL-E/Documents/Developpements/Jamoma/Max/source/classwrapper/TTClassWrapperMax.h::2013:
:
In file included from In file included from /Users/WALL-E/Documents/Developpements/Jamoma/Max/source/c74support/max-includes/ext.h/Users/WALL-E/Documents/Developpements/Jamoma/Max/source/c74support/max-includes/ext.h::2020:
:
/Users/WALL-E/Documents/Developpements/Jamoma/Max/source/c74support/max-includes/ext_prefix.h/Users/WALL-E/Documents/Developpements/Jamoma/Max/source/c74support/max-includes/ext_prefix.h::147147::10:10 : fatal error: fatal error: 'MacTypes.h''MacTypes.h'  filefile  notnot  foundfound

In file included from #include <MacTypes.h>#include <MacTypes.h>

/Users/WALL-E/Documents/Developpements/Jamoma/Max/source/classwrapper/TTModularClassWrapperMax.cpp:         ^         ^10

:
In file included from /Users/WALL-E/Documents/Developpements/Jamoma/Max/source/classwrapper/TTModularClassWrapperMax.h:20:
In file included from /Users/WALL-E/Documents/Developpements/Jamoma/Max/source/c74support/max-includes/ext.h:20:
/Users/WALL-E/Documents/Developpements/Jamoma/Max/source/c74support/max-includes/ext_prefix.h:147:10: fatal error: 'MacTypes.h' file not found
#include <MacTypes.h>
         ^
1 error generated.
make[2]: *** [source/CMakeFiles/MaxCommonSyms.dir/c74support/max-includes/common/commonsyms.cpp.o] Error 1
make[1]: *** [source/CMakeFiles/MaxCommonSyms.dir/all] Error 2
make[1]: *** Waiting for unfinished jobs....
[  2%] Building CXX object JamomaCore/Foundation/library/CMakeFiles/Foundation.dir/source/TTCallback.cpp.o
In file included from /Users/WALL-E/Documents/Developpements/Jamoma/Max/JamomaCore/Foundation/library/source/TTCallback.cpp:18:
In file included from /Users/WALL-E/Documents/Developpements/Jamoma/Max/JamomaCore/Foundation/library/includes/TTCallback.h:21:
In file included from /Users/WALL-E/Documents/Developpements/Jamoma/Max/JamomaCore/Foundation/library/includes/TTFoundationAPI.h:13:
In file included from /Users/WALL-E/Documents/Developpements/Jamoma/Max/JamomaCore/Foundation/library/includes/TTFoundation.h:14:
/Users/WALL-E/Documents/Developpements/Jamoma/Max/JamomaCore/Foundation/library/includes/TTBase.h:24:11: fatal error: 'TargetConditionals.h' file not found
        #include "TargetConditionals.h"
                 ^
1 error generated.
1 error generated.
make[2]: *** [JamomaCore/Foundation/library/CMakeFiles/Foundation.dir/source/TTCallback.cpp.o] Error 1
make[2]: *** Waiting for unfinished jobs....
make[2]: *** [JamomaCore/Modular/library/CMakeFiles/TTClock.dir/source/TTClock.cpp.o] Error 1
make[1]: *** [JamomaCore/Modular/library/CMakeFiles/TTClock.dir/all] Error 2
1 error generated.
make[2]: *** [JamomaCore/Modular/library/CMakeFiles/TTProtocol.dir/source/TTProtocol.cpp.o] Error 1
make[1]: *** [JamomaCore/Modular/library/CMakeFiles/TTProtocol.dir/all] Error 2
[  2%] Building CXX object source/CMakeFiles/MaxAudioGraph.dir/classwrapper/MaxGraph.cpp.o
1 error generated.
make[2]: *** [JamomaCore/Foundation/library/CMakeFiles/Foundation.dir/source/TTFoundation.cpp.o] Error 1
make[1]: *** [JamomaCore/Foundation/library/CMakeFiles/Foundation.dir/all] Error 2
In file included from /Users/WALL-E/Documents/Developpements/Jamoma/Max/source/classwrapper/MaxGraph.cpp:11:
In file included from /Users/WALL-E/Documents/Developpements/Jamoma/Max/source/classwrapper/MaxGraph.h:14:
In file included from /Users/WALL-E/Documents/Developpements/Jamoma/Max/source/c74support/max-includes/ext.h:20:
/Users/WALL-E/Documents/Developpements/Jamoma/Max/source/c74support/max-includes/ext_prefix.h:147:10: fatal error: 'MacTypes.h' file not found
#include <MacTypes.h>
         ^
1 error generated.
make[2]: *** [source/CMakeFiles/TTModularClassWrapperMax.dir/classwrapper/TTModularClassWrapperMax.cpp.o] Error 1
make[1]: *** [source/CMakeFiles/TTModularClassWrapperMax.dir/all] Error 2
1 error generated.
make[2]: *** [JamomaCore/Score/CMakeFiles/TimePluginLib.dir/extensions/TimePluginLib.cpp.o] Error 1
make[1]: *** [JamomaCore/Score/CMakeFiles/TimePluginLib.dir/all] Error 2
1 error generated.
1 error generated.
make[2]: *** [source/CMakeFiles/MaxAudioGraph.dir/classwrapper/MaxAudioGraph.cpp.o] Error 1
make[2]: *** Waiting for unfinished jobs....
make[2]: *** [source/CMakeFiles/TTClassWrapperMax.dir/classwrapper/TTClassWrapperMax.cpp.o] Error 1
make[1]: *** [source/CMakeFiles/TTClassWrapperMax.dir/all] Error 2
1 error generated.
make[2]: *** [source/CMakeFiles/MaxAudioGraph.dir/classwrapper/MaxGraph.cpp.o] Error 1
make[1]: *** [source/CMakeFiles/MaxAudioGraph.dir/all] Error 2
make: *** [all] Error 2
wall-e:Max WALL-E$

------------------------------------------------------------------------------

_______________________________________________
Jamoma-devel mailing list
[hidden email]
https://lists.sourceforge.net/lists/listinfo/jamoma-devel


------------------------------------------------------------------------------
_______________________________________________
Jamoma-devel mailing list
[hidden email]
https://lists.sourceforge.net/lists/listinfo/jamoma-devel


------------------------------------------------------------------------------

_______________________________________________
Jamoma-devel mailing list
[hidden email]
https://lists.sourceforge.net/lists/listinfo/jamoma-devel



------------------------------------------------------------------------------

_______________________________________________
Jamoma-devel mailing list
[hidden email]
https://lists.sourceforge.net/lists/listinfo/jamoma-devel
Reply | Threaded
Open this post in threaded view
|  
Report Content as Inappropriate

Re: build under Max OS X El Capitan fails

Théo de la Hogue-2
In reply to this post by Trond Lossius
Hi Trond,

Le 2 oct. 2015 à 12:19, Trond Lossius <[hidden email]> a écrit :

Hi Theo,

I haven't updated to El Capitan yet, but I've updated Xcode.
ah ok ! I’ve done the both in the row effectively.

Xcode 7 deletes the sdks for all older Osx versions, so I afterwards had to go inside the Xcode app package, and use TimeMachine ti recover the sdks for 19.10 and 10.9.

Unless you have already dine this, it might be worth a try.
no I didn’t try it.

thanks for you support !

Best,
TO


Best,
Trond

Sorry for the typing errors, blame my iPhone

On 2. okt. 2015, at 11.54, Théo de la Hogue <[hidden email]> wrote:

Hi all,
just to warn you that JamomaMax no longer builds under the last Mac OS X version.

here is my console output (after having configured and generated CMake files).

is anyone have an idea how to fix this ?

Best,
TO

wall-e:Max WALL-E$ make clean
wall-e:Max WALL-E$ make -j 8
Scanning dependencies of target MaxCommonSyms
Scanning dependencies of target TTClassWrapperMax
Scanning dependencies of target TTModularClassWrapperMax
[  0%] Building CXX object JamomaCore/Modular/library/CMakeFiles/TTProtocol.dir/source/TTProtocol.cpp.o
[  1%] Building CXX object JamomaCore/Modular/library/CMakeFiles/TTClock.dir/source/TTClock.cpp.o
[  1%] Building CXX object JamomaCore/Score/CMakeFiles/TimePluginLib.dir/extensions/TimePluginLib.cpp.o
Scanning dependencies of target MaxAudioGraph
[  1%] Building CXX object source/CMakeFiles/MaxCommonSyms.dir/c74support/max-includes/common/commonsyms.cpp.o
[  1%] Building CXX object source/CMakeFiles/TTClassWrapperMax.dir/classwrapper/TTClassWrapperMax.cpp.o
[  1%] Building CXX object source/CMakeFiles/TTModularClassWrapperMax.dir/classwrapper/TTModularClassWrapperMax.cpp.o
[  1%] Building CXX object JamomaCore/Foundation/library/CMakeFiles/Foundation.dir/source/TTFoundation.cpp.o
[  2%] Building CXX object source/CMakeFiles/MaxAudioGraph.dir/classwrapper/MaxAudioGraph.cpp.o
In file included from In file included from In file included from /Users/WALL-E/Documents/Developpements/Jamoma/Max/JamomaCore/Foundation/library/source/TTFoundation.cppIn file included from :9:
/Users/WALL-E/Documents/Developpements/Jamoma/Max/JamomaCore/Score/extensions/TimePluginLib.cppIn file included from /Users/WALL-E/Documents/Developpements/Jamoma/Max/JamomaCore/Modular/library/source/TTProtocol.cpp/Users/WALL-E/Documents/Developpements/Jamoma/Max/JamomaCore/Foundation/library/includes/TTFoundation.h::1714:
:
/Users/WALL-E/Documents/Developpements/Jamoma/Max/JamomaCore/Modular/library/source/TTClock.cppIn file included from :/Users/WALL-E/Documents/Developpements/Jamoma/Max/JamomaCore/Modular/library/includes/TTProtocol.h17::
20In file included from :
/Users/WALL-E/Documents/Developpements/Jamoma/Max/JamomaCore/Modular/library/includes/TTClock.hIn file included from ::20/Users/WALL-E/Documents/Developpements/Jamoma/Max/JamomaCore/Foundation/library/includes/TTFoundationAPI.h16:
::
In file included from 13In file included from /Users/WALL-E/Documents/Developpements/Jamoma/Max/JamomaCore/Foundation/library/includes/TTFoundationAPI.h:
:/Users/WALL-E/Documents/Developpements/Jamoma/Max/JamomaCore/Score/extensions/TimePluginLib.hIn file included from 13:/Users/WALL-E/Documents/Developpements/Jamoma/Max/JamomaCore/Foundation/library/includes/TTFoundation.h:
21:In file included from :
14/Users/WALL-E/Documents/Developpements/Jamoma/Max/JamomaCore/Foundation/library/includes/TTFoundation.h:
:In file included from 14/Users/WALL-E/Documents/Developpements/Jamoma/Max/JamomaCore/Score/library/includes/TTScore.h:
:21:
/Users/WALL-E/Documents/Developpements/Jamoma/Max/source/c74support/max-includes/common/commonsyms.cpp:4:10: fatal error: /Users/WALL-E/Documents/Developpements/Jamoma/Max/JamomaCore/Foundation/library/includes/TTBase.h:/Users/WALL-E/Documents/Developpements/Jamoma/Max/JamomaCore/Foundation/library/includes/TTBase.h/Users/WALL-E/Documents/Developpements/Jamoma/Max/JamomaCore/Foundation/library/includes/TTBase.h24::/Users/WALL-E/Documents/Developpements/Jamoma/Max/JamomaCore/Score/library/includes/TTScoreIncludes.h:242411'Carbon/Carbon.h'::: 42 file11: :not11fatal error ::: found10 :
  'TargetConditionals.h' fatal errorfile:  fatal errornotfatal error : : found'TargetConditionals.h' 
'TargetConditionals.h'file'math.h'   filenotfile   notnotfound  foundfound


        #include "TargetConditionals.h"        #include "TargetConditionals.h"
        #include "TargetConditionals.h"

#include <math.h>                 ^#include <Carbon/Carbon.h>                 ^



                 ^         ^

         ^
In file included from In file included from /Users/WALL-E/Documents/Developpements/Jamoma/Max/source/classwrapper/MaxAudioGraph.cpp/Users/WALL-E/Documents/Developpements/Jamoma/Max/source/classwrapper/TTClassWrapperMax.cpp::1710:
:
In file included from In file included from /Users/WALL-E/Documents/Developpements/Jamoma/Max/source/classwrapper/MaxAudioGraph.h/Users/WALL-E/Documents/Developpements/Jamoma/Max/source/classwrapper/TTClassWrapperMax.h::2013:
:
In file included from In file included from /Users/WALL-E/Documents/Developpements/Jamoma/Max/source/c74support/max-includes/ext.h/Users/WALL-E/Documents/Developpements/Jamoma/Max/source/c74support/max-includes/ext.h::2020:
:
/Users/WALL-E/Documents/Developpements/Jamoma/Max/source/c74support/max-includes/ext_prefix.h/Users/WALL-E/Documents/Developpements/Jamoma/Max/source/c74support/max-includes/ext_prefix.h::147147::10:10 : fatal error: fatal error: 'MacTypes.h''MacTypes.h'  filefile  notnot  foundfound

In file included from #include <MacTypes.h>#include <MacTypes.h>

/Users/WALL-E/Documents/Developpements/Jamoma/Max/source/classwrapper/TTModularClassWrapperMax.cpp:         ^         ^10

:
In file included from /Users/WALL-E/Documents/Developpements/Jamoma/Max/source/classwrapper/TTModularClassWrapperMax.h:20:
In file included from /Users/WALL-E/Documents/Developpements/Jamoma/Max/source/c74support/max-includes/ext.h:20:
/Users/WALL-E/Documents/Developpements/Jamoma/Max/source/c74support/max-includes/ext_prefix.h:147:10: fatal error: 'MacTypes.h' file not found
#include <MacTypes.h>
         ^
1 error generated.
make[2]: *** [source/CMakeFiles/MaxCommonSyms.dir/c74support/max-includes/common/commonsyms.cpp.o] Error 1
make[1]: *** [source/CMakeFiles/MaxCommonSyms.dir/all] Error 2
make[1]: *** Waiting for unfinished jobs....
[  2%] Building CXX object JamomaCore/Foundation/library/CMakeFiles/Foundation.dir/source/TTCallback.cpp.o
In file included from /Users/WALL-E/Documents/Developpements/Jamoma/Max/JamomaCore/Foundation/library/source/TTCallback.cpp:18:
In file included from /Users/WALL-E/Documents/Developpements/Jamoma/Max/JamomaCore/Foundation/library/includes/TTCallback.h:21:
In file included from /Users/WALL-E/Documents/Developpements/Jamoma/Max/JamomaCore/Foundation/library/includes/TTFoundationAPI.h:13:
In file included from /Users/WALL-E/Documents/Developpements/Jamoma/Max/JamomaCore/Foundation/library/includes/TTFoundation.h:14:
/Users/WALL-E/Documents/Developpements/Jamoma/Max/JamomaCore/Foundation/library/includes/TTBase.h:24:11: fatal error: 'TargetConditionals.h' file not found
        #include "TargetConditionals.h"
                 ^
1 error generated.
1 error generated.
make[2]: *** [JamomaCore/Foundation/library/CMakeFiles/Foundation.dir/source/TTCallback.cpp.o] Error 1
make[2]: *** Waiting for unfinished jobs....
make[2]: *** [JamomaCore/Modular/library/CMakeFiles/TTClock.dir/source/TTClock.cpp.o] Error 1
make[1]: *** [JamomaCore/Modular/library/CMakeFiles/TTClock.dir/all] Error 2
1 error generated.
make[2]: *** [JamomaCore/Modular/library/CMakeFiles/TTProtocol.dir/source/TTProtocol.cpp.o] Error 1
make[1]: *** [JamomaCore/Modular/library/CMakeFiles/TTProtocol.dir/all] Error 2
[  2%] Building CXX object source/CMakeFiles/MaxAudioGraph.dir/classwrapper/MaxGraph.cpp.o
1 error generated.
make[2]: *** [JamomaCore/Foundation/library/CMakeFiles/Foundation.dir/source/TTFoundation.cpp.o] Error 1
make[1]: *** [JamomaCore/Foundation/library/CMakeFiles/Foundation.dir/all] Error 2
In file included from /Users/WALL-E/Documents/Developpements/Jamoma/Max/source/classwrapper/MaxGraph.cpp:11:
In file included from /Users/WALL-E/Documents/Developpements/Jamoma/Max/source/classwrapper/MaxGraph.h:14:
In file included from /Users/WALL-E/Documents/Developpements/Jamoma/Max/source/c74support/max-includes/ext.h:20:
/Users/WALL-E/Documents/Developpements/Jamoma/Max/source/c74support/max-includes/ext_prefix.h:147:10: fatal error: 'MacTypes.h' file not found
#include <MacTypes.h>
         ^
1 error generated.
make[2]: *** [source/CMakeFiles/TTModularClassWrapperMax.dir/classwrapper/TTModularClassWrapperMax.cpp.o] Error 1
make[1]: *** [source/CMakeFiles/TTModularClassWrapperMax.dir/all] Error 2
1 error generated.
make[2]: *** [JamomaCore/Score/CMakeFiles/TimePluginLib.dir/extensions/TimePluginLib.cpp.o] Error 1
make[1]: *** [JamomaCore/Score/CMakeFiles/TimePluginLib.dir/all] Error 2
1 error generated.
1 error generated.
make[2]: *** [source/CMakeFiles/MaxAudioGraph.dir/classwrapper/MaxAudioGraph.cpp.o] Error 1
make[2]: *** Waiting for unfinished jobs....
make[2]: *** [source/CMakeFiles/TTClassWrapperMax.dir/classwrapper/TTClassWrapperMax.cpp.o] Error 1
make[1]: *** [source/CMakeFiles/TTClassWrapperMax.dir/all] Error 2
1 error generated.
make[2]: *** [source/CMakeFiles/MaxAudioGraph.dir/classwrapper/MaxGraph.cpp.o] Error 1
make[1]: *** [source/CMakeFiles/MaxAudioGraph.dir/all] Error 2
make: *** [all] Error 2
wall-e:Max WALL-E$
------------------------------------------------------------------------------
_______________________________________________
Jamoma-devel mailing list
[hidden email]
https://lists.sourceforge.net/lists/listinfo/jamoma-devel
------------------------------------------------------------------------------
_______________________________________________
Jamoma-devel mailing list
[hidden email]
https://lists.sourceforge.net/lists/listinfo/jamoma-devel


------------------------------------------------------------------------------

_______________________________________________
Jamoma-devel mailing list
[hidden email]
https://lists.sourceforge.net/lists/listinfo/jamoma-devel
Reply | Threaded
Open this post in threaded view
|  
Report Content as Inappropriate

Re: build under Max OS X El Capitan fails

Théo de la Hogue-2
In reply to this post by Antoine Villeret
ok
time to eat something before to dive into those troubles :-)

thanks again !

Best,
TO

Le 2 oct. 2015 à 12:23, Antoine Villeret <[hidden email]> a écrit :

thanks for the report, 
so it seems that you missed TargetConditionals.h and can't say more, sorry :-(
sounds like Apple removed that file when updating...

as a quick fix you can find it there : 

good luck

antoine

--
do it yourself                      
http://antoine.villeret.free.fr

2015-10-02 12:15 GMT+02:00 Théo de la Hogue <[hidden email]>:
Hi Antoine !
here is the output with make only :

[  0%] Building CXX object JamomaCore/Foundation/library/CMakeFiles/Foundation.dir/source/TTFoundation.cpp.o
In file included from /Users/WALL-E/Documents/Developpements/Jamoma/Max/JamomaCore/Foundation/library/source/TTFoundation.cpp:9:
In file included from /Users/WALL-E/Documents/Developpements/Jamoma/Max/JamomaCore/Foundation/library/includes/TTFoundation.h:14:
/Users/WALL-E/Documents/Developpements/Jamoma/Max/JamomaCore/Foundation/library/includes/TTBase.h:24:11: fatal error: 'TargetConditionals.h' file not found
        #include "TargetConditionals.h"
                 ^
1 error generated.
make[2]: *** [JamomaCore/Foundation/library/CMakeFiles/Foundation.dir/source/TTFoundation.cpp.o] Error 1
make[1]: *** [JamomaCore/Foundation/library/CMakeFiles/Foundation.dir/all] Error 2
make: *** [all] Error 2

I'm connected on skype if you need me to test things.
thanks for your help !

Best,
TO

Le 2 oct. 2015 à 12:02, Antoine Villeret <[hidden email]> a écrit :

hi theo, 

seems that some file are not found.

could re-run make without -j 8 option ?
-j 8 causes error message to be scramble all together and not easily readable.

best

Antoine

--
do it yourself                      
http://antoine.villeret.free.fr

2015-10-02 11:54 GMT+02:00 Théo de la Hogue <[hidden email]>:
Hi all,
just to warn you that JamomaMax no longer builds under the last Mac OS X version.

here is my console output (after having configured and generated CMake files).

is anyone have an idea how to fix this ?

Best,
TO

wall-e:Max WALL-E$ make clean
wall-e:Max WALL-E$ make -j 8
Scanning dependencies of target MaxCommonSyms
Scanning dependencies of target TTClassWrapperMax
Scanning dependencies of target TTModularClassWrapperMax
[  0%] Building CXX object JamomaCore/Modular/library/CMakeFiles/TTProtocol.dir/source/TTProtocol.cpp.o
[  1%] Building CXX object JamomaCore/Modular/library/CMakeFiles/TTClock.dir/source/TTClock.cpp.o
[  1%] Building CXX object JamomaCore/Score/CMakeFiles/TimePluginLib.dir/extensions/TimePluginLib.cpp.o
Scanning dependencies of target MaxAudioGraph
[  1%] Building CXX object source/CMakeFiles/MaxCommonSyms.dir/c74support/max-includes/common/commonsyms.cpp.o
[  1%] Building CXX object source/CMakeFiles/TTClassWrapperMax.dir/classwrapper/TTClassWrapperMax.cpp.o
[  1%] Building CXX object source/CMakeFiles/TTModularClassWrapperMax.dir/classwrapper/TTModularClassWrapperMax.cpp.o
[  1%] Building CXX object JamomaCore/Foundation/library/CMakeFiles/Foundation.dir/source/TTFoundation.cpp.o
[  2%] Building CXX object source/CMakeFiles/MaxAudioGraph.dir/classwrapper/MaxAudioGraph.cpp.o
In file included from In file included from In file included from /Users/WALL-E/Documents/Developpements/Jamoma/Max/JamomaCore/Foundation/library/source/TTFoundation.cppIn file included from :9:
/Users/WALL-E/Documents/Developpements/Jamoma/Max/JamomaCore/Score/extensions/TimePluginLib.cppIn file included from /Users/WALL-E/Documents/Developpements/Jamoma/Max/JamomaCore/Modular/library/source/TTProtocol.cpp/Users/WALL-E/Documents/Developpements/Jamoma/Max/JamomaCore/Foundation/library/includes/TTFoundation.h::1714:
:
/Users/WALL-E/Documents/Developpements/Jamoma/Max/JamomaCore/Modular/library/source/TTClock.cppIn file included from :/Users/WALL-E/Documents/Developpements/Jamoma/Max/JamomaCore/Modular/library/includes/TTProtocol.h17::
20In file included from :
/Users/WALL-E/Documents/Developpements/Jamoma/Max/JamomaCore/Modular/library/includes/TTClock.hIn file included from ::20/Users/WALL-E/Documents/Developpements/Jamoma/Max/JamomaCore/Foundation/library/includes/TTFoundationAPI.h16:
::
In file included from 13In file included from /Users/WALL-E/Documents/Developpements/Jamoma/Max/JamomaCore/Foundation/library/includes/TTFoundationAPI.h:
:/Users/WALL-E/Documents/Developpements/Jamoma/Max/JamomaCore/Score/extensions/TimePluginLib.hIn file included from 13:/Users/WALL-E/Documents/Developpements/Jamoma/Max/JamomaCore/Foundation/library/includes/TTFoundation.h:
21:In file included from :
14/Users/WALL-E/Documents/Developpements/Jamoma/Max/JamomaCore/Foundation/library/includes/TTFoundation.h:
:In file included from 14/Users/WALL-E/Documents/Developpements/Jamoma/Max/JamomaCore/Score/library/includes/TTScore.h:
:21:
/Users/WALL-E/Documents/Developpements/Jamoma/Max/source/c74support/max-includes/common/commonsyms.cpp:4:10: fatal error: /Users/WALL-E/Documents/Developpements/Jamoma/Max/JamomaCore/Foundation/library/includes/TTBase.h:/Users/WALL-E/Documents/Developpements/Jamoma/Max/JamomaCore/Foundation/library/includes/TTBase.h/Users/WALL-E/Documents/Developpements/Jamoma/Max/JamomaCore/Foundation/library/includes/TTBase.h24::/Users/WALL-E/Documents/Developpements/Jamoma/Max/JamomaCore/Score/library/includes/TTScoreIncludes.h:242411'Carbon/Carbon.h'::: 42 file11: :not11fatal error ::: found10 :
  'TargetConditionals.h' fatal errorfile:  fatal errornotfatal error : : found'TargetConditionals.h' 
'TargetConditionals.h'file'math.h'   filenotfile   notnotfound  foundfound


        #include "TargetConditionals.h"        #include "TargetConditionals.h"
        #include "TargetConditionals.h"

#include <math.h>                 ^#include <Carbon/Carbon.h>                 ^



                 ^         ^

         ^
In file included from In file included from /Users/WALL-E/Documents/Developpements/Jamoma/Max/source/classwrapper/MaxAudioGraph.cpp/Users/WALL-E/Documents/Developpements/Jamoma/Max/source/classwrapper/TTClassWrapperMax.cpp::1710:
:
In file included from In file included from /Users/WALL-E/Documents/Developpements/Jamoma/Max/source/classwrapper/MaxAudioGraph.h/Users/WALL-E/Documents/Developpements/Jamoma/Max/source/classwrapper/TTClassWrapperMax.h::2013:
:
In file included from In file included from /Users/WALL-E/Documents/Developpements/Jamoma/Max/source/c74support/max-includes/ext.h/Users/WALL-E/Documents/Developpements/Jamoma/Max/source/c74support/max-includes/ext.h::2020:
:
/Users/WALL-E/Documents/Developpements/Jamoma/Max/source/c74support/max-includes/ext_prefix.h/Users/WALL-E/Documents/Developpements/Jamoma/Max/source/c74support/max-includes/ext_prefix.h::147147::10:10 : fatal error: fatal error: 'MacTypes.h''MacTypes.h'  filefile  notnot  foundfound

In file included from #include <MacTypes.h>#include <MacTypes.h>

/Users/WALL-E/Documents/Developpements/Jamoma/Max/source/classwrapper/TTModularClassWrapperMax.cpp:         ^         ^10

:
In file included from /Users/WALL-E/Documents/Developpements/Jamoma/Max/source/classwrapper/TTModularClassWrapperMax.h:20:
In file included from /Users/WALL-E/Documents/Developpements/Jamoma/Max/source/c74support/max-includes/ext.h:20:
/Users/WALL-E/Documents/Developpements/Jamoma/Max/source/c74support/max-includes/ext_prefix.h:147:10: fatal error: 'MacTypes.h' file not found
#include <MacTypes.h>
         ^
1 error generated.
make[2]: *** [source/CMakeFiles/MaxCommonSyms.dir/c74support/max-includes/common/commonsyms.cpp.o] Error 1
make[1]: *** [source/CMakeFiles/MaxCommonSyms.dir/all] Error 2
make[1]: *** Waiting for unfinished jobs....
[  2%] Building CXX object JamomaCore/Foundation/library/CMakeFiles/Foundation.dir/source/TTCallback.cpp.o
In file included from /Users/WALL-E/Documents/Developpements/Jamoma/Max/JamomaCore/Foundation/library/source/TTCallback.cpp:18:
In file included from /Users/WALL-E/Documents/Developpements/Jamoma/Max/JamomaCore/Foundation/library/includes/TTCallback.h:21:
In file included from /Users/WALL-E/Documents/Developpements/Jamoma/Max/JamomaCore/Foundation/library/includes/TTFoundationAPI.h:13:
In file included from /Users/WALL-E/Documents/Developpements/Jamoma/Max/JamomaCore/Foundation/library/includes/TTFoundation.h:14:
/Users/WALL-E/Documents/Developpements/Jamoma/Max/JamomaCore/Foundation/library/includes/TTBase.h:24:11: fatal error: 'TargetConditionals.h' file not found
        #include "TargetConditionals.h"
                 ^
1 error generated.
1 error generated.
make[2]: *** [JamomaCore/Foundation/library/CMakeFiles/Foundation.dir/source/TTCallback.cpp.o] Error 1
make[2]: *** Waiting for unfinished jobs....
make[2]: *** [JamomaCore/Modular/library/CMakeFiles/TTClock.dir/source/TTClock.cpp.o] Error 1
make[1]: *** [JamomaCore/Modular/library/CMakeFiles/TTClock.dir/all] Error 2
1 error generated.
make[2]: *** [JamomaCore/Modular/library/CMakeFiles/TTProtocol.dir/source/TTProtocol.cpp.o] Error 1
make[1]: *** [JamomaCore/Modular/library/CMakeFiles/TTProtocol.dir/all] Error 2
[  2%] Building CXX object source/CMakeFiles/MaxAudioGraph.dir/classwrapper/MaxGraph.cpp.o
1 error generated.
make[2]: *** [JamomaCore/Foundation/library/CMakeFiles/Foundation.dir/source/TTFoundation.cpp.o] Error 1
make[1]: *** [JamomaCore/Foundation/library/CMakeFiles/Foundation.dir/all] Error 2
In file included from /Users/WALL-E/Documents/Developpements/Jamoma/Max/source/classwrapper/MaxGraph.cpp:11:
In file included from /Users/WALL-E/Documents/Developpements/Jamoma/Max/source/classwrapper/MaxGraph.h:14:
In file included from /Users/WALL-E/Documents/Developpements/Jamoma/Max/source/c74support/max-includes/ext.h:20:
/Users/WALL-E/Documents/Developpements/Jamoma/Max/source/c74support/max-includes/ext_prefix.h:147:10: fatal error: 'MacTypes.h' file not found
#include <MacTypes.h>
         ^
1 error generated.
make[2]: *** [source/CMakeFiles/TTModularClassWrapperMax.dir/classwrapper/TTModularClassWrapperMax.cpp.o] Error 1
make[1]: *** [source/CMakeFiles/TTModularClassWrapperMax.dir/all] Error 2
1 error generated.
make[2]: *** [JamomaCore/Score/CMakeFiles/TimePluginLib.dir/extensions/TimePluginLib.cpp.o] Error 1
make[1]: *** [JamomaCore/Score/CMakeFiles/TimePluginLib.dir/all] Error 2
1 error generated.
1 error generated.
make[2]: *** [source/CMakeFiles/MaxAudioGraph.dir/classwrapper/MaxAudioGraph.cpp.o] Error 1
make[2]: *** Waiting for unfinished jobs....
make[2]: *** [source/CMakeFiles/TTClassWrapperMax.dir/classwrapper/TTClassWrapperMax.cpp.o] Error 1
make[1]: *** [source/CMakeFiles/TTClassWrapperMax.dir/all] Error 2
1 error generated.
make[2]: *** [source/CMakeFiles/MaxAudioGraph.dir/classwrapper/MaxGraph.cpp.o] Error 1
make[1]: *** [source/CMakeFiles/MaxAudioGraph.dir/all] Error 2
make: *** [all] Error 2
wall-e:Max WALL-E$

------------------------------------------------------------------------------

_______________________________________________
Jamoma-devel mailing list
[hidden email]
https://lists.sourceforge.net/lists/listinfo/jamoma-devel


------------------------------------------------------------------------------
_______________________________________________
Jamoma-devel mailing list
[hidden email]
https://lists.sourceforge.net/lists/listinfo/jamoma-devel


------------------------------------------------------------------------------

_______________________________________________
Jamoma-devel mailing list
[hidden email]
https://lists.sourceforge.net/lists/listinfo/jamoma-devel


------------------------------------------------------------------------------
_______________________________________________
Jamoma-devel mailing list
[hidden email]
https://lists.sourceforge.net/lists/listinfo/jamoma-devel


------------------------------------------------------------------------------

_______________________________________________
Jamoma-devel mailing list
[hidden email]
https://lists.sourceforge.net/lists/listinfo/jamoma-devel
Loading...